[linux-dvb] unable to compile latest HG

Stephen Rowles stephen at rowles.org.uk
Mon Jan 28 16:06:36 CET 2008


Hi,

I am trying to build the latest HG to get the fixes for my Nova-T-Stick
that were added a couple of days ago. However I the following problem with
the stk-webcam modiles:

Is there something I'm missing? Do I need a later kernel than the 2.6.21
that I currently have or is there some other problem?

As I don't need this device, is there an easy way to stop it being built?

Cheers.

Steve


Make Error:

[root at lounge v4l-dvb]# make
make -C /home/root/dvb/latest-hg/v4l-dvb/v4l
make[1]: Entering directory `/home/root/dvb/latest-hg/v4l-dvb/v4l'
creating symbolic links...
Kernel build directory is /lib/modules/2.6.21-1.3194.fc7/build
make -C /lib/modules/2.6.21-1.3194.fc7/build
SUBDIRS=/home/root/dvb/latest-hg/v4l-dvb/v4l  modules
make[2]: Entering directory `/usr/src/kernels/2.6.21-1.3194.fc7-i686'
  CC [M]  /home/root/dvb/latest-hg/v4l-dvb/v4l/stk-webcam.o
/home/root/dvb/latest-hg/v4l-dvb/v4l/stk-webcam.c: In function
'stk_isoc_handler':
/home/root/dvb/latest-hg/v4l-dvb/v4l/stk-webcam.c:400: warning: implicit
declaration of function 'list_first_entry'
/home/root/dvb/latest-hg/v4l-dvb/v4l/stk-webcam.c:401: error: expected
expression before 'struct'
/home/root/dvb/latest-hg/v4l-dvb/v4l/stk-webcam.c:401: warning: assignment
makes pointer from integer without a cast
/home/root/dvb/latest-hg/v4l-dvb/v4l/stk-webcam.c:448: error: expected
expression before 'struct'
/home/root/dvb/latest-hg/v4l-dvb/v4l/stk-webcam.c:448: warning: assignment
makes pointer from integer without a cast
/home/root/dvb/latest-hg/v4l-dvb/v4l/stk-webcam.c: In function
'v4l_stk_read':
/home/root/dvb/latest-hg/v4l-dvb/v4l/stk-webcam.c:778: error: expected
expression before 'struct'
/home/root/dvb/latest-hg/v4l-dvb/v4l/stk-webcam.c:778: warning: assignment
makes pointer from integer without a cast
/home/root/dvb/latest-hg/v4l-dvb/v4l/stk-webcam.c: In function
'stk_vidioc_dqbuf':
/home/root/dvb/latest-hg/v4l-dvb/v4l/stk-webcam.c:1251: error: expected
expression before 'struct'
/home/root/dvb/latest-hg/v4l-dvb/v4l/stk-webcam.c:1251: warning:
assignment makes pointer from integer without a cast
make[3]: *** [/home/root/dvb/latest-hg/v4l-dvb/v4l/stk-webcam.o] Error 1
make[2]: *** [_module_/home/root/dvb/latest-hg/v4l-dvb/v4l] Error 2
make[2]: Leaving directory `/usr/src/kernels/2.6.21-1.3194.fc7-i686'
make[1]: *** [default] Error 2
make[1]: Leaving directory `/home/root/dvb/latest-hg/v4l-dvb/v4l'
make: *** [all] Error 2





More information about the linux-dvb mailing list