[vdr] Bug streamdev CVS 1.10.2005 vs VDR 1.3.33

Marko Myllymäki marko.myllymaki at sci.fi
Sun Oct 2 01:47:14 CEST 2005


Seems to be related with the includes (GCC 4), Deti's patch for 1.3.32 seems 
to work, thanks.

Br. Marko


---
make[1]: Entering directory `/root/vdr-1.3.33/PLUGINS/src/streamdev'
g++ -W -Woverloaded-virtual -O2 -c -D_GNU_SOURCE -DHAVE_AUTOPID -I../../../include
 -I../../../../DVB/include -I. -o client/filter.o client/filter.c
client/filter.c: In constructor âcStreamdevFilters::cStreamdevFilters()â:
client/filter.c:58: error: âTS_SIZEâ was not declared in this scope
client/filter.c: In member function âvoid cStreamdevFilters::Put(const
uchar*)â:
client/filter.c:85: error: âTS_SIZEâ was not declared in this scope
client/filter.c: In member function âvirtual void
cStreamdevFilters::Action()â:
client/filter.c:98: error: âPID_MASK_HIâ was not declared in this scope
client/filter.c:112: error: âTS_SIZEâ was not declared in this scope
make[1]: *** [client/filter.o] Error 1
make[1]: Leaving directory `/root/vdr-1.3.33/PLUGINS/src/streamdev'
---
I'm using: Linux version 2.6.11-1.1369_FC4smp
(bhcompile at decompose.build.redhat.com) (gcc version 4.0.0 20050525 (Red Hat
4.0.0-9)) #1 SMP Thu Jun 2 23:08:39 EDT 2005




More information about the vdr mailing list