[vdr] wirblescan 0.0.5-pre11e compilation errors

YUP yupadmin at gmail.com
Mon Apr 26 16:00:42 CEST 2010


Hello,

Did anybody try to compile latest wirblescan plugin for vdr 1.7.14? I
mean version 0.0.5-pre11e. I've got these errors:

scanner.c: In member function ‘virtual void cScanner::Action()’:
scanner.c:679:25: error: expected type-specifier
scanner.c:679:25: error: cannot convert ‘int*’ to ‘cSwReceiver*’ in
assignment scanner.c:679:25: error: expected ‘;’
scanner.c:957:28: error: expected type-specifier
scanner.c:957:28: error: cannot convert ‘int*’ to ‘cSwReceiver*’ in
assignment scanner.c:957:28: error: expected ‘;’
make: *** [scanner.o] Error 1

I didn't find maintener's direct email address, that is why I decided to
write to this mailing list.

Regards,

Yarema





More information about the vdr mailing list