[vdr] wirblescan 0.0.5-pre11e compilation errors

Goga777 goga777 at bk.ru
Tue Apr 27 13:00:57 CEST 2010


Приветствую, YUP

does support wirbelscan 0.0.5 dvb-s2 or not ?

> Did anybody try to compile latest wirblescan plugin for vdr 1.7.14? I
> mean version 0.0.5-pre11e. I've got these errors:
> 
> scanner.c: In member function ‘virtual void cScanner::Action()’:
> scanner.c:679:25: error: expected type-specifier
> scanner.c:679:25: error: cannot convert ‘int*’ to ‘cSwReceiver*’ in
> assignment scanner.c:679:25: error: expected ‘;’
> scanner.c:957:28: error: expected type-specifier
> scanner.c:957:28: error: cannot convert ‘int*’ to ‘cSwReceiver*’ in
> assignment scanner.c:957:28: error: expected ‘;’
> make: *** [scanner.o] Error 1
> 
> I didn't find maintener's direct email address, that is why I decided to
> write to this mailing list.



More information about the vdr mailing list