[vdr] Cannot compile vdr-plugin-streamdev from today cvs against vdr 1.7.11

YUP yupadmin at gmail.com
Sat Jan 9 23:29:17 CET 2010


Compilation breaks with the following error:

server/connectionVTP.c: In member function ‘bool cLSTEHandler::Next(bool&)’:
server/connectionVTP.c:303: error: ‘const class cEvent’ has no member 
named ‘GetContentsString?’
server/connectionVTP.c:304: error: ‘const class cEvent’ has no member 
named ‘GetContentsString?’
make: *** [server/connectionVTP.o] Error 1

Regards,

YUP



More information about the vdr mailing list